clang++ -O3 -march=native -ffast-math -fno-finite-math-only -funroll-loops -flto -fuse-ld=lld -std=c++20 -static -DNDEBUG -DEVALFILE=\"C:/dev/OpenBench/Client/Networks/77F8F4D5\" ./src/Prelude.cpp ./src/accumulator.cpp ./src/board.cpp ./src/datagen.cpp ./src/move.cpp ./src/movegen.cpp ./src/nnue.cpp ./src/search.cpp ./src/searcher.cpp ./external/fmt/format.cc -o Prelude-64B3710D-77F8F4D5
In file included from ./src/Prelude.cpp:1:
In file included from C:\Program Files\Microsoft Visual Studio\2022\Community\VC\Tools\MSVC\14.42.34433\include\algorithm:10:
In file included from C:\Program Files\Microsoft Visual Studio\2022\Community\VC\Tools\MSVC\14.42.34433\include\__msvc_heap_algorithms.hpp:11:
In file included from C:\Program Files\Microsoft Visual Studio\2022\Community\VC\Tools\MSVC\14.42.34433\include\xutility:8:
C:\Program Files\Microsoft Visual Studio\2022\Community\VC\Tools\MSVC\14.42.34433\include\yvals.h:20:10: fatal error: 'crtdbg.h' file not found
20 | #include <crtdbg.h>
| ^~~~~~~~~~
1 error generated.
In file included from ./src/accumulator.cpp:1:
In file included from ./src\accumulator.h:3:
In file included from ./src\types.h:3:
C:\Program Files\Microsoft Visual Studio\2022\Community\VC\Tools\MSVC\14.42.34433\include\cstdlib:11:10: fatal error: 'math.h' file not found
11 | #include <math.h>
| ^~~~~~~~
1 error generated.
In file included from ./src/board.cpp:1:
In file included from ./src\board.h:3:
In file included from ./src\util.h:3:
In file included from C:\Program Files\Microsoft Visual Studio\2022\Community\VC\Tools\MSVC\14.42.34433\include\bit:15:
C:\Program Files\Microsoft Visual Studio\2022\Community\VC\Tools\MSVC\14.42.34433\include\cstdlib:11:10: fatal error: 'math.h' file not found
11 | #include <math.h>
| ^~~~~~~~
1 error generated.
In file included from ./src/datagen.cpp:1:
In file included from ./src\datagen.h:3:
In file included from ./src\types.h:3:
C:\Program Files\Microsoft Visual Studio\2022\Community\VC\Tools\MSVC\14.42.34433\include\cstdlib:11:10: fatal error: 'math.h' file not found
11 | #include <math.h>
| ^~~~~~~~
1 error generated.
In file included from ./src/move.cpp:1:
In file included from ./src\move.h:3:
C:\Program Files\Microsoft Visual Studio\2022\Community\VC\Tools\MSVC\14.42.34433\include\cassert:9:10: fatal error: 'assert.h' file not found
9 | #include <assert.h>
| ^~~~~~~~~~
1 error generated.
In file included from ./src/movegen.cpp:1:
In file included from ./src\movegen.h:3:
In file included from ./src\types.h:3:
C:\Program Files\Microsoft Visual Studio\2022\Community\VC\Tools\MSVC\14.42.34433\include\cstdlib:11:10: fatal error: 'math.h' file not found
11 | #include <math.h>
| ^~~~~~~~
1 error generated.
In file included from ./src/nnue.cpp:1:
In file included from ./src\nnue.h:3:
In file included from ./src\types.h:3:
C:\Program Files\Microsoft Visual Studio\2022\Community\VC\Tools\MSVC\14.42.34433\include\cstdlib:11:10: fatal error: 'math.h' file not found
11 | #include <math.h>
| ^~~~~~~~
1 error generated.
In file included from ./src/search.cpp:1:
In file included from ./src\search.h:3:
In file included from ./src\types.h:3:
C:\Program Files\Microsoft Visual Studio\2022\Community\VC\Tools\MSVC\14.42.34433\include\cstdlib:11:10: fatal error: 'math.h' file not found
11 | #include <math.h>
| ^~~~~~~~
1 error generated.
In file included from ./src/searcher.cpp:1:
In file included from ./src\searcher.h:3:
In file included from ./src\ttable.h:3:
In file included from ./src\types.h:3:
C:\Program Files\Microsoft Visual Studio\2022\Community\VC\Tools\MSVC\14.42.34433\include\cstdlib:11:10: fatal error: 'math.h' file not found
11 | #include <math.h>
| ^~~~~~~~
1 error generated.
In file included from ./external/fmt/format.cc:8:
In file included from ./external/fmt\fmt/format-inl.h:12:
In file included from C:\Program Files\Microsoft Visual Studio\2022\Community\VC\Tools\MSVC\14.42.34433\include\algorithm:10:
In file included from C:\Program Files\Microsoft Visual Studio\2022\Community\VC\Tools\MSVC\14.42.34433\include\__msvc_heap_algorithms.hpp:11:
In file included from C:\Program Files\Microsoft Visual Studio\2022\Community\VC\Tools\MSVC\14.42.34433\include\xutility:8:
C:\Program Files\Microsoft Visual Studio\2022\Community\VC\Tools\MSVC\14.42.34433\include\yvals.h:20:10: fatal error: 'crtdbg.h' file not found
20 | #include <crtdbg.h>
| ^~~~~~~~~~
1 error generated.
make: *** [makefile:29: Prelude-64B3710D-77F8F4D5] Error 1