clang++ -O3 -std=c++20 -Wall -Wextra -march=native -flto -fuse-ld=lld  -DEVALFILE=\"C:/dev/OpenBench/Client/Networks/A2CEDA30\" Turbulence_v4/BitManipulation.cpp Turbulence_v4/Board.cpp Turbulence_v4/Evaluation.cpp Turbulence_v4/MoveGeneration.cpp Turbulence_v4/Search.cpp Turbulence_v4/UCI.cpp -o Turbulence-63DD7674-A2CEDA30
In file included from Turbulence_v4/BitManipulation.cpp:1:
In file included from Turbulence_v4\BitManipulation.h:4:
In file included from C:\Program Files\Microsoft Visual Studio\2022\Community\VC\Tools\MSVC\14.42.34433\include\bit:15:
C:\Program Files\Microsoft Visual Studio\2022\Community\VC\Tools\MSVC\14.42.34433\include\cstdlib:11:10: fatal error: 'math.h' file not found
   11 | #include <math.h>
      |          ^~~~~~~~
1 error generated.
In file included from Turbulence_v4/Board.cpp:1:
In file included from Turbulence_v4\Board.h:7:
In file included from C:\Program Files\Microsoft Visual Studio\2022\Community\VC\Tools\MSVC\14.42.34433\include\string:10:
In file included from C:\Program Files\Microsoft Visual Studio\2022\Community\VC\Tools\MSVC\14.42.34433\include\xstring:11:
In file included from C:\Program Files\Microsoft Visual Studio\2022\Community\VC\Tools\MSVC\14.42.34433\include\__msvc_string_view.hpp:12:
In file included from C:\Program Files\Microsoft Visual Studio\2022\Community\VC\Tools\MSVC\14.42.34433\include\iosfwd:8:
C:\Program Files\Microsoft Visual Studio\2022\Community\VC\Tools\MSVC\14.42.34433\include\yvals.h:20:10: fatal error: 'crtdbg.h' file not found
   20 | #include <crtdbg.h>
      |          ^~~~~~~~~~
1 error generated.
In file included from Turbulence_v4/Evaluation.cpp:3:
In file included from Turbulence_v4\Evaluation.h:2:
In file included from Turbulence_v4\Board.h:7:
In file included from C:\Program Files\Microsoft Visual Studio\2022\Community\VC\Tools\MSVC\14.42.34433\include\string:10:
In file included from C:\Program Files\Microsoft Visual Studio\2022\Community\VC\Tools\MSVC\14.42.34433\include\xstring:11:
In file included from C:\Program Files\Microsoft Visual Studio\2022\Community\VC\Tools\MSVC\14.42.34433\include\__msvc_string_view.hpp:12:
In file included from C:\Program Files\Microsoft Visual Studio\2022\Community\VC\Tools\MSVC\14.42.34433\include\iosfwd:8:
C:\Program Files\Microsoft Visual Studio\2022\Community\VC\Tools\MSVC\14.42.34433\include\yvals.h:20:10: fatal error: 'crtdbg.h' file not found
   20 | #include <crtdbg.h>
      |          ^~~~~~~~~~
1 error generated.
In file included from Turbulence_v4/MoveGeneration.cpp:1:
In file included from Turbulence_v4\MoveGeneration.h:2:
In file included from C:\Program Files\Microsoft Visual Studio\2022\Community\VC\Tools\MSVC\14.42.34433\include\string:10:
In file included from C:\Program Files\Microsoft Visual Studio\2022\Community\VC\Tools\MSVC\14.42.34433\include\xstring:11:
In file included from C:\Program Files\Microsoft Visual Studio\2022\Community\VC\Tools\MSVC\14.42.34433\include\__msvc_string_view.hpp:12:
In file included from C:\Program Files\Microsoft Visual Studio\2022\Community\VC\Tools\MSVC\14.42.34433\include\iosfwd:8:
C:\Program Files\Microsoft Visual Studio\2022\Community\VC\Tools\MSVC\14.42.34433\include\yvals.h:20:10: fatal error: 'crtdbg.h' file not found
   20 | #include <crtdbg.h>
      |          ^~~~~~~~~~
1 error generated.
In file included from Turbulence_v4/Search.cpp:1:
In file included from Turbulence_v4\MoveGeneration.h:2:
In file included from C:\Program Files\Microsoft Visual Studio\2022\Community\VC\Tools\MSVC\14.42.34433\include\string:10:
In file included from C:\Program Files\Microsoft Visual Studio\2022\Community\VC\Tools\MSVC\14.42.34433\include\xstring:11:
In file included from C:\Program Files\Microsoft Visual Studio\2022\Community\VC\Tools\MSVC\14.42.34433\include\__msvc_string_view.hpp:12:
In file included from C:\Program Files\Microsoft Visual Studio\2022\Community\VC\Tools\MSVC\14.42.34433\include\iosfwd:8:
C:\Program Files\Microsoft Visual Studio\2022\Community\VC\Tools\MSVC\14.42.34433\include\yvals.h:20:10: fatal error: 'crtdbg.h' file not found
   20 | #include <crtdbg.h>
      |          ^~~~~~~~~~
1 error generated.
In file included from Turbulence_v4/UCI.cpp:3:
In file included from Turbulence_v4\MoveGeneration.h:2:
In file included from C:\Program Files\Microsoft Visual Studio\2022\Community\VC\Tools\MSVC\14.42.34433\include\string:10:
In file included from C:\Program Files\Microsoft Visual Studio\2022\Community\VC\Tools\MSVC\14.42.34433\include\xstring:11:
In file included from C:\Program Files\Microsoft Visual Studio\2022\Community\VC\Tools\MSVC\14.42.34433\include\__msvc_string_view.hpp:12:
In file included from C:\Program Files\Microsoft Visual Studio\2022\Community\VC\Tools\MSVC\14.42.34433\include\iosfwd:8:
C:\Program Files\Microsoft Visual Studio\2022\Community\VC\Tools\MSVC\14.42.34433\include\yvals.h:20:10: fatal error: 'crtdbg.h' file not found
   20 | #include <crtdbg.h>
      |          ^~~~~~~~~~
1 error generated.
make: *** [Makefile:27: Turbulence-63DD7674-A2CEDA30] Error 1