make -C src release EXE=Prelude-99A82DF0.exe
make[1]: Entering directory 'C:/Users/gokun_gws/AppData/Local/Temp/tmpzd_bzucu/Prelude/Prelude-tmp/src'
/usr/bin/sh: -c: line 2: syntax error: unexpected end of file
Compiling Game.cpp
Compiling BBmacros.cpp
Compiling Perseus.cpp
Compiling Position.cpp
Compiling bench.cpp
Compiling constants.cpp
make[2]: *** [build.mk:53: dirs] Error 2
make[2]: *** Waiting for unfinished jobs....
error: unable to open output file 'obj/Release/BBmacros.o': 'No such file or directory'
1 error generated.
error: unable to open output file 'obj/Release/Game.o': 'No such file or directory'
1 error generated.
make[2]: *** [build.mk:60: obj/Release/BBmacros.o] Error 1
error: unable to open output file 'obj/Release/Perseus.o': 'No such file or directory'
1 error generated.
error: unable to open output file 'obj/Release/Position.o': 'No such file or directory'
1 error generated.
make[2]: *** [build.mk:60: obj/Release/Game.o] Error 1
error: unable to open output file 'obj/Release/bench.o': 'No such file or directory'
1 error generated.
error: unable to open output file 'obj/Release/constants.o': 'No such file or directory'
1 error generated.
make[2]: *** [build.mk:60: obj/Release/Perseus.o] Error 1
make[2]: *** [build.mk:60: obj/Release/Position.o] Error 1
make[2]: *** [build.mk:60: obj/Release/bench.o] Error 1
make[2]: *** [build.mk:60: obj/Release/constants.o] Error 1
Compiling evaluation.cpp
Compiling magic.cpp
Compiling tt.cpp
Compiling search.cpp
Compiling movegen.cpp
Compiling move.cpp
Compiling tables.cpp
Compiling random.cpp
Compiling history.cpp
error: unable to open output file 'obj/Release/tt.o': 'No such file or directory'
1 error generated.
error: unable to open output file 'obj/Release/magic.o': 'No such file or directory'
1 error generated.
make[2]: *** [build.mk:60: obj/Release/tt.o] Error 1
error: unable to open output file 'obj/Release/search.o': 'No such file or directory'
1 error generated.
error: unable to open output file 'obj/Release/evaluation.o': 'No such file or directory'
1 error generated.
error: unable to open output file 'obj/Release/move.o': 'No such file or directory'
1 error generated.
make[2]: *** [build.mk:60: obj/Release/magic.o] Error 1
error: unable to open output file 'obj/Release/movegen.o': 'No such file or directory'
1 error generated.
make[2]: *** [build.mk:60: obj/Release/search.o] Error 1
error: unable to open output file 'obj/Release/random.o': 'No such file or directory'
1 error generated.
make[2]: *** [build.mk:60: obj/Release/evaluation.o] Error 1
make[2]: *** [build.mk:60: obj/Release/move.o] Error 1
make[2]: *** [build.mk:60: obj/Release/movegen.o] Error 1
make[2]: *** [build.mk:60: obj/Release/random.o] Error 1
error: unable to open output file 'obj/Release/history.o': 'No such file or directory'
1 error generated.
error: unable to open output file 'obj/Release/tables.o': 'No such file or directory'
1 error generated.
make[2]: *** [build.mk:60: obj/Release/history.o] Error 1
make[2]: *** [build.mk:60: obj/Release/tables.o] Error 1
make[1]: *** [makefile:6: release] Error 2
make[1]: Leaving directory 'C:/Users/gokun_gws/AppData/Local/Temp/tmpzd_bzucu/Prelude/Prelude-tmp/src'
make: *** [makefile:25: release] Error 2